{"text_format":"1","workbook":"xlsx","n_sheets":16,"sheets":["Notes","Instructions","BaselineParameters","REFERENCE","1- pre screen","Summary","2- Proposal","3- Study Inputs","4- Study Results","5- Incremental Costs","6- Baseline Hourly Results","7- Proposed Hourly Results","Prescreening Review","Proposal Review","Study Review","Financial Model inputs"],"not_rendered":{"charts":0,"images":3,"macros":1,"external_links":4,"defined_names":97,"comments":7,"pivot_tables":0},"unopened":[],"bounds":{"document_bytes":16777216,"sheet_cells":100000,"rows_first":2000,"rows_last":500,"rows_between":2000,"halvings":0,"cell_chars":16384,"cell_head_chars":4096},"cells_cut":0,"cells_raw":0,"read":"whole","date_system":"1900"}

{"sheet":"Notes","index":0,"n_rows":23,"n_cols":2,"rows_kept":23,"cut":false,"hidden":true,"merged":[]}
[null,"Concept design (LCE Baseline) energy model does not change from pre-screening going forward to proposal and study submission."]
[null,"Pre-screen to be submitted before kick off meeting and after doing the concept design modelling"]
[null,"Fill the pre-screening sheet for each building where there is good potential for electrification."]
[null,"Proposal to be submitted after kick off meeting"]
[]
[]
[null,"A clear EM is a measure that saves GHG and increases electricity."]
[null,"All ECMs (gas and/or electric) or EMs all must be included in final proposed bundle model."]
[null,"Electric ECMs (saving only electricity) will not be modelled separately. GHG, energy, costing impacts of these ECMs must be equaly included in both baseline and porposed models."]
[null,"Non-fuel-switching gas saving measures (e.g. low flow fixtures, condensing boilers, etc.) should not be modelled separately. They are to be included in EM models and bundle model."]
{"$rows_left_out":14}
{"sheet":"Instructions","index":1,"n_rows":68,"n_cols":2,"rows_kept":68,"cut":false,"hidden":false,"merged":[[18,1,18,12],[28,0,28,12],[6,0,6,12],[9,1,9,12],[10,1,10,12],[11,1,11,12],[17,1,17,12],[15,1,15,12],[16,1,16,12],[24,0,24,12],[54,0,54,12],[32,0,32,12],[35,0,35,12],[20,0,20,11],[50,0,50,12],[46,0,46,12],[37,0,37,12],[42,0,42,12],[44,0,44,12],[39,0,39,12]]}
["Provincial Commercial New Construction Program"]
[]
["Energy Modeling Study Proposal and Report Workbook"]
[]
["Introduction"]
[]
["This workbook has been developed for the Provincial Commercial New Construction Program (the Program) to standardize the energy modeling study reporting format and provide consultants performing the work the  minimum inputs/results information required for the technical review and proposal/study approval process. This workbook is to be completed as part of the requirements for energy study funding under the Program and it has to be submitted to BC Hydro in its original electronic format. \n\nAt the project eligibility assessment stage, this workbook (with Pre-Screen worksheet filled out) is to be submitted along with associated preliminary calculations / estimates that support the electrical load growth and fuel offset claims. The data provided will be evaluated by the Program's engineering team and, if accepted, the project will proceed to project application stage.\n\nAt the project application stage, this workbook (with Proposal worksheet filled out) is to be submitted along with project application and consultants' proposal(s). The consultant's proposal(s) do not need to contain project technical details, but just  a reference to this workbook (Proposal worksheet tab). Information provided in this workbook need not be duplicated in the Consultants' proposal(s).  \n\nAt the study report submission stage, this workbook is the only document required by BC Hydro for review. Consultants are welcome to organize and present study results to the customer in a different format. If required, consultants are also welcome to add additional worksheets to the end of this workbook with additional calculations and project details.\n\nThe workbook has been formatted to minimize re-entering data and shall be filled out in the following order:"]
[]
["Worksheet tab color-coding conventions"]
[null,"Green worksheets are input worksheets. "]
{"$rows_left_out":59}
{"sheet":"BaselineParameters","index":2,"n_rows":85,"n_cols":10,"rows_kept":85,"cut":false,"hidden":false,"merged":[]}
["Building Type","Location","ASHRAE Climate Zone","Step","Design Infiltration Rate (m3/s/m2 envelope area)","HRV Effectiveness","TEDI (kWh/m2)","GHG (kgCO2/m2)","Enevelope Surface Heat Loss (Opaque + Window), W/m2","Infiltration Heat Loss, W/m2"]
["MURB","Vancouver","Climate Zone 4","Step Code 1",2.5000000000000001E-4,"None",62.220884359999999,11.07634271,27.796003898635476,5.9468591617933715]
["MURB","Vancouver","Climate Zone 4","Step Code 2",2.5000000000000001E-4,0.6,40.623692599999998,6.1632938939999997,27.814780701754387,4.8217334307992203]
["MURB","Vancouver","Climate Zone 4","Step Code 3",1E-4,0.6,28.232626230000001,6.0027645400000003,23.474563840155948,1.9476659356725143]
["MURB","Vancouver","Climate Zone 4","Step Code 4",1.0000000000000001E-5,0.6,14.24695766,5.790910888,15.972102826510721,0.16824015594541911]
["MURB","Kamloops","Climate Zone 5","Step Code 1",2.5000000000000001E-4,"None",74.511951280000005,12.119135,44.245338693957109,8.4671710526315795]
["MURB","Kamloops","Climate Zone 5","Step Code 2",2.5000000000000001E-4,0.6,44.076813440000002,6.2651899000000002,37.761776315789476,6.7253299220272895]
["MURB","Kamloops","Climate Zone 5","Step Code 3",1E-4,0.6,29.87712938,6.0803965819999997,34.550601851851845,2.7076734892787524]
["MURB","Kamloops","Climate Zone 5","Step Code 4",1.0000000000000001E-5,0.8,14.77145335,5.8530522139999999,23.01348440545809,0.23064127680311888]
["MURB","Prince George","Climate Zone 6","Step Code 1",2.5000000000000001E-4,"None",83.202311030000004,14.14945065,34.753715886939574,5.234348927875244]
{"$rows_left_out":76}
{"sheet":"REFERENCE","index":3,"n_rows":90,"n_cols":28,"rows_kept":90,"cut":false,"hidden":true,"merged":[]}
["Climate Zone","Building Types",null,"Standard EMs (choose one)","EM EMLs","Sorting Options","Standard End Use","Energy Codes","Units","ICC Units",null,"Heating Source",null,null,null,null,"Yes/No",null,null,"Proposed Space Heating",null,null,"Exterior Wall Types",null,null,null,"Electricity Rates"]
["GVRD and Victoria (ASHRAE Zone 4C)","Mixed Use",null,"HVAC Air Source VRF Distributed Heat Pumps",18,"Project #","Process HVAC","Step Code 1","Metric units","m2",null,"Electric",null,null,null,null,"Yes  ",null,null,null,"None",null,"Mass",null,null,null,"SGS","Small General Service"]
["City of Vancouver and SFU (ASHRAE Zone 5)","Automotive Facility",null,"HVAC Air-to-Air Heat Pump (ductless or minisplit)",18,"Project Name","Fans","Step Code 2","Imperial units","ft2",null,"Hybrid","elec and gas serve the same system",null,null,null,"No",null,null,null,"PTACand PTHP",null,"Metal Building",null,null,null,"MGS","Medium General Service"]
["BC Interior Kelowna, Vernon (ASHRAE Zone 5)","Convention Centre",null,"HVAC Air-to-Water Heat Pump",15,"Building Type","Pumps","Step Code 3",null,"# of units",null,"DES",null,null,null,null,null,null,null,null,"PSZ-AC - Pack rooftop air conditioner CV",null,"Steel-framed",null,null,null,"LGS","Large General Service"]
["Vancouver Island except Victoria (ASHRAE Zone 5)","Courthouse",null,"HVAC Electric Boiler",20,"Area","DHW","Step Code 4",null,"L/s",null,"Natural Gas ",null,null,null,null,null,null,null,null,"Baseboard heating",null,"Wood-framed and Other",null,null,null,"TSR","Transmission Service Rate"]
["Coastal BC (ASHRAE Zone 5)","Dining: Bar/Lounge/Leisure",null,"HVAC Electric Water Heater",15,"Climate Zone","Space Cooling","ASHRAE 90.1 2016",null,"CFM",null,"Renewable Natural Gas ",null,null,null,null,null,null,null,null,"VAV box (overhead and underfloor)",null,null,null,null,null,"RES 1","Residential Tier 1"]
["BC South Interior (ASHRAE Zone 6)","Dining: Cafeteria/Fast Food",null,"HVAC Exhaust Air Heat Recovery Heat Pump",15,"Mech Consultant","Plug Load","NECB 2015",null,"TON",null,"Propane ",null,null,null,null,null,null,null,null,"Fan Coil unit",null,null,null,null,null,"RES 2","Residential Tier 2"]
["BC Interior (ASHRAE Zone 7)","Dining: Family",null,"HVAC Ground Source Heat Pump",15,"Elec Consultant","Refrigeration",null,null,"kW",null,"Light Fuel Oil ",null,null,null,null,null,null,null,null,"Distributed heat pump "]
["Northern BC (ASHRAE Zone 8)","Dormitory",null,"HVAC Heat Recovery Chiller",22,null,"Elevators",null,null,"hp",null,"Heavy Fuel Oil ",null,null,null,null,null,null,null,null,"Thermal displacement ventilation"]
["Lower Mainland and Victoria (NECB Zone 4)","Exercise Centre",null,"HVAC High-efficiency (>75%) HRV",15,null,"IT Process Load",null,null,"GPM",null,"Kerosene ",null,null,null,null,null,null,null,null,"Chilled-beam"]
{"$rows_left_out":81}
{"sheet":"1- pre screen","index":4,"n_rows":123,"n_cols":7,"rows_kept":123,"cut":false,"hidden":false,"merged":[[1,0,1,1],[8,0,9,0],[76,0,88,5],[94,0,106,5],[23,1,23,4],[22,1,22,4],[11,1,11,4],[10,1,10,4]]}
["Provincial Commercial New Construction Program - Project Eligibility Screening Sheet"]
["Green cells for user inputs (if applicable)"]
[]
["Date submitted   (DD-MM-YYYY)",null,"Day-Month-Year"]
["Name of BC Hydro Key Account Manager (KAM)","KAM's name"]
[]
[]
[]
["General Project Information"]
[]
{"$rows_left_out":114}
{"sheet":"Summary","index":5,"n_rows":35,"n_cols":8,"rows_kept":35,"cut":false,"hidden":false,"merged":[[0,0,0,5],[1,1,1,3],[33,4,33,5],[34,4,34,5],[29,4,29,5],[30,4,30,5],[31,4,31,5],[32,4,32,5]]}
["Provincial Commercial New Construction Program\nSummary report",null,null,null,null,null,null,"Workbook\nVersion 1.0"]
[null,{"$f":"IF('4- Study Results'!B18=\"\",IF('2- Proposal'!B21:C21=\"\",\"Pre-screen\",\"Proposal\"),\"Study Report\")","v":"Pre-screen"}]
["Energy Modeling Study Report Summary"]
["Project Name and Location",{"$f":"'3- Study Inputs'!B5","v":"Project Name"},null,{"$f":"'1- pre screen'!B12","v":"City Name"},"printed:",{"$f":"TODAY()","v":"2019-03-27"}]
["Project Owner",{"$f":"'3- Study Inputs'!B7","v":"Company Name1"},null,null,"BC Hydro Ref #",{"$f":"'3- Study Inputs'!D1","v":"BCH-00000"}]
["Building Types",{"$f":"'3- Study Inputs'!B23:C23","v":0},{"$f":"'3- Study Inputs'!G23","v":0},{"$f":"'3- Study Inputs'!L23","v":0},{"$f":"'3- Study Inputs'!Q23","v":0},"Total Conditioned Area (m2)"]
["Conditioned Area (m2)",{"$f":"'3- Study Inputs'!B24","v":0},{"$f":"'3- Study Inputs'!G24","v":0},{"$f":"'3- Study Inputs'!L24","v":0},{"$f":"'3- Study Inputs'!Q24","v":0},{"$f":"SUM(B7:E7)","v":0}]
["Net Incremental GHG Emissions ",{"$f":"'4- Study Results'!N91","v":0},"tonneCO2e","over measures life"]
["Net Incremental Fuel Consumption",{"$f":"'4- Study Results'!F44","v":0},"GJ / year",">>>>>>",{"$f":"(B9/'4- Study Results'!B78)*1000/3.6","v":{"$error":"#DIV/0!"}},"off Baseline Gas"]
["Net Incremental GHG Emissions",{"$f":"'4- Study Results'!F45","v":0},"tonneCO2e / year",">>>>>>",{"$f":"B10/'4- Study Results'!B76","v":{"$error":"#DIV/0!"}},"of Baseline GHG"]
{"$rows_left_out":26}
{"sheet":"2- Proposal","index":6,"n_rows":186,"n_cols":19,"rows_kept":186,"cut":false,"hidden":false,"merged":[[16,1,16,3],[4,1,4,4],[5,1,5,4],[65,16,65,17],[66,16,66,17],[95,16,95,17],[96,16,96,17],[100,16,100,17],[30,16,30,17],[31,16,31,17],[32,16,32,17],[42,16,42,17],[41,15,41,17],[46,16,46,17],[35,15,35,17],[47,15,47,17],[43,16,43,17],[44,16,44,17],[28,5,28,7],[18,15,18,17],[21,16,21,17],[22,16,22,17],[19,16,19,17],[20,6,20,7],[107,16,107,17],[108,16,108,17],[109,16,109,17],[23,6,23,7],[102,16,102,17],[103,16,103,17],[104,16,104,17],[18,0,18,2],[21,1,21,2],[20,1,20,2],[28,0,28,2],[29,1,29,2],[30,1,30,2],[27,1,27,2],[24,1,24,2],[22,1,22,2],[19,1,19,2],[33,1,33,2],[34,1,34,2],[32,1,32,2],[27,6,27,7],[102,1,102,2],[33,11,33,12],[96,11,96,12],[110,11,110,12],[104,1,104,2],[104,6,104,7],[104,11,104,12],[93,5,93,7],[93,10,93,12],[99,0,99,2],[99,5,99,7],[99,10,99,12],[95,11,95,12],[107,11,107,12],[108,11,108,12],[109,11,109,12],[105,11,105,12],[106,10,106,12],[106,0,106,2],[101,0,101,2],[109,1,109,2],[107,6,107,7],[108,6,108,7],[109,6,109,7],[110,6,110,7],[100,11,100,12],[34,6,34,7],[41,5,41,7],[30,6,30,7],[31,6,31,7],[32,6,32,7],[103,11,103,12],[41,10,41,12],[46,11,46,12],[35,10,35,12],[101,10,101,12],[102,11,102,12],[35,5,35,7],[47,5,47,7],[85,5,85,7],[42,11,42,12],[67,10,67,12],[44,11,44,12],[65,11,65,12],[45,11,45,12],[45,6,45,7],[101,5,101,7],[65,1,65,2],[65,6,65,7],[66,6,66,7],[95,6,95,7],[96,6,96,7],[100,6,100,7],[43,6,43,7],[66,1,66,2],[67,0,67,2],[85,0,85,2],[45,1,45,2],[18,10,18,12],[21,11,21,12],[22,11,22,12],[18,5,18,7],[21,6,21,7],[22,6,22,7],[19,6,19,7],[20,11,20,12],[23,11,23,12],[19,11,19,12],[26,16,26,17],[66,11,66,12],[20,16,20,17],[25,16,25,17],[24,16,24,17],[27,11,27,12],[28,10,28,12],[93,15,93,17],[99,15,99,17],[43,11,43,12],[26,11,26,12],[23,16,23,17],[85,10,85,12],[30,11,30,12],[31,11,31,12],[32,11,32,12],[45,16,45,17],[54,10,54,12],[34,11,34,12],[24,11,24,12],[25,11,25,12],[47,10,47,12],[29,11,29,12],[23,1,23,2],[25,1,25,2],[31,1,31,2],[54,5,54,7],[67,5,67,7],[26,1,26,2],[44,6,44,7],[95,1,95,2],[96,1,96,2],[43,1,43,2],[93,0,93,2],[44,1,44,2],[46,6,46,7],[42,1,42,2],[25,6,25,7],[24,6,24,7],[41,0,41,2],[47,0,47,2],[54,0,54,2],[42,6,42,7],[46,1,46,2],[35,0,35,2],[29,6,29,7],[33,6,33,7],[1,0,1,1],[116,0,133,4],[105,16,105,17],[29,16,29,17],[33,16,33,17],[34,16,34,17],[54,15,54,17],[67,15,67,17],[85,15,85,17],[101,15,101,17],[106,15,106,17],[110,16,110,17],[103,1,103,2],[105,1,105,2],[107,1,107,2],[108,1,108,2],[102,6,102,7],[103,6,103,7],[105,6,105,7],[106,5,106,7],[110,1,110,2],[26,6,26,7],[27,16,27,17],[28,15,28,17]]}
["Provincial Commercial New Construction Program - Energy Study Proposal",null,"BC Hydro Ref # >>>","BCH-00000"]
["Green cells for user inputs (if applicable)",null,"BC Hydro KAM >>>",{"$f":"'1- pre screen'!B5","v":"KAM's name"}]
[null,null,"Proposal Date  >>>",null,"Day-Month-Year"]
["1. General Information"]
[{"$f":"'1- pre screen'!A11","v":"Project Name"},{"$f":"'1- pre screen'!B11","v":"Project Name"}]
[{"$f":"'1- pre screen'!A12","v":"Location/Address"},{"$f":"'1- pre screen'!B12","v":"City Name"}]
[{"$f":"'1- pre screen'!A13","v":"Project Developer/Owner"},{"$f":"'1- pre screen'!B13","v":"Company Name1"},{"$f":"'1- pre screen'!C13","v":"contact name1"},{"$f":"'1- pre screen'!D13","v":"phone1"},{"$f":"'1- pre screen'!E13","v":"email1"}]
[{"$f":"'1- pre screen'!A14","v":"Primary (Lead) Consultant"},{"$f":"'1- pre screen'!B14","v":"Company Name2"},{"$f":"'1- pre screen'!C14","v":"contact name2"},{"$f":"'1- pre screen'!D14","v":"phone2"},{"$f":"'1- pre screen'!E14","v":"email2"}]
[{"$f":"'1- pre screen'!A15","v":"Energy Modeller"},{"$f":"'1- pre screen'!B15","v":"Company Name3"},{"$f":"'1- pre screen'!C15","v":"contact name3"},{"$f":"'1- pre screen'!D15","v":"phone3"},{"$f":"'1- pre screen'!E15","v":"email3"}]
["Mechanical Consultant","Company Name4","contact name4","phone4","email4"]
{"$rows_left_out":177}
{"sheet":"3- Study Inputs","index":7,"n_rows":139,"n_cols":19,"rows_kept":139,"cut":false,"hidden":false,"merged":[[108,11,108,12],[108,16,108,17],[106,0,106,2],[106,5,106,7],[106,10,106,12],[104,1,104,2],[104,6,104,7],[103,11,103,12],[106,15,106,17],[107,1,107,2],[107,6,107,7],[107,11,107,12],[107,16,107,17],[108,1,108,2],[108,6,108,7],[4,1,4,4],[5,1,5,4],[103,16,103,17],[104,16,104,17],[105,16,105,17],[67,15,67,17],[42,16,42,17],[43,16,43,17],[44,16,44,17],[47,15,47,17],[54,15,54,17],[41,15,41,17],[95,11,95,12],[96,11,96,12],[95,16,95,17],[96,16,96,17],[105,1,105,2],[105,6,105,7],[105,11,105,12],[103,1,103,2],[103,6,103,7],[104,11,104,12],[101,0,101,2],[101,5,101,7],[109,1,109,2],[109,6,109,7],[109,11,109,12],[109,16,109,17],[110,1,110,2],[110,6,110,7],[110,11,110,12],[110,16,110,17],[116,0,133,4],[101,10,101,12],[101,15,101,17],[102,1,102,2],[102,6,102,7],[102,11,102,12],[102,16,102,17],[85,0,85,2],[85,5,85,7],[85,10,85,12],[85,15,85,17],[93,0,93,2],[93,5,93,7],[93,10,93,12],[93,15,93,17],[95,1,95,2],[96,1,96,2],[99,0,99,2],[99,5,99,7],[99,10,99,12],[99,15,99,17],[95,6,95,7],[96,6,96,7],[65,1,65,2],[66,1,66,2],[67,0,67,2],[67,5,67,7],[67,10,67,12],[65,16,65,17],[66,16,66,17],[47,0,47,2],[47,5,47,7],[47,10,47,12],[65,6,65,7],[66,6,66,7],[65,11,65,12],[66,11,66,12],[54,0,54,2],[54,5,54,7],[54,10,54,12],[46,1,46,2],[46,6,46,7],[46,11,46,12],[46,16,46,17],[42,6,42,7],[43,6,43,7],[44,6,44,7],[42,11,42,12],[43,11,43,12],[44,11,44,12],[45,1,45,2],[45,6,45,7],[45,11,45,12],[45,16,45,17],[41,0,41,2],[41,5,41,7],[41,10,41,12],[35,0,35,2],[35,5,35,7],[35,10,35,12],[42,1,42,2],[43,1,43,2],[44,1,44,2],[35,15,35,17],[32,1,32,2],[33,1,33,2],[33,6,33,7],[33,11,33,12],[33,16,33,17],[34,1,34,2],[34,6,34,7],[34,11,34,12],[34,16,34,17],[32,6,32,7],[32,11,32,12],[32,16,32,17],[18,0,18,2],[18,5,18,7],[18,10,18,12],[18,15,18,17],[19,1,19,2],[19,6,19,7],[19,11,19,12],[19,16,19,17],[24,1,24,2],[24,6,24,7],[24,11,24,12],[24,16,24,17],[22,1,22,2],[22,6,22,7],[22,11,22,12],[22,16,22,17],[23,1,23,2],[23,6,23,7],[23,11,23,12],[23,16,23,17],[29,1,29,2],[29,6,29,7],[29,11,29,12],[29,16,29,17],[30,1,30,2],[31,1,31,2],[27,1,27,2],[27,6,27,7],[27,11,27,12],[27,16,27,17],[28,0,28,2],[28,5,28,7],[28,10,28,12],[28,15,28,17],[30,6,30,7],[31,6,31,7],[30,11,30,12],[31,11,31,12],[30,16,30,17],[31,16,31,17],[26,1,26,2],[26,6,26,7],[26,11,26,12],[26,16,26,17],[20,1,20,2],[20,6,20,7],[20,11,20,12],[20,16,20,17],[21,1,21,2],[21,6,21,7],[21,11,21,12],[21,16,21,17],[25,1,25,2],[25,6,25,7],[25,11,25,12],[25,16,25,17]]}
["Provincial Commercial New Construction Program - Energy Study Inputs",null,"BC Hydro Ref # >>>",{"$f":"'2- Proposal'!D1","v":"BCH-00000"}]
["Grey cells for user inputs (only where different from proposal)",null,"BC Hydro KAM >>>",{"$f":"'2- Proposal'!D2","v":"KAM's name"}]
[null,null,"Study Date  >>>",null,"Day-Month-Year"]
["1. General Information"]
[{"$f":"'1- pre screen'!A11","v":"Project Name"},{"$f":"'2- Proposal'!B5","v":"Project Name"}]
[{"$f":"'1- pre screen'!A12","v":"Location/Address"},{"$f":"'2- Proposal'!B6","v":"City Name"}]
[{"$f":"'1- pre screen'!A13","v":"Project Developer/Owner"},{"$f":"'2- Proposal'!B7","v":"Company Name1"},{"$f":"'2- Proposal'!C7","v":"contact name1"},{"$f":"'2- Proposal'!D7","v":"phone1"},{"$f":"'2- Proposal'!E7","v":"email1"}]
[{"$f":"'1- pre screen'!A14","v":"Primary (Lead) Consultant"},{"$f":"'2- Proposal'!B8","v":"Company Name2"},{"$f":"'2- Proposal'!C8","v":"contact name2"},{"$f":"'2- Proposal'!D8","v":"phone2"},{"$f":"'2- Proposal'!E8","v":"email2"}]
[{"$f":"'1- pre screen'!A15","v":"Energy Modeller"},{"$f":"'2- Proposal'!B9","v":"Company Name3"},{"$f":"'2- Proposal'!C9","v":"contact name3"},{"$f":"'2- Proposal'!D9","v":"phone3"},{"$f":"'2- Proposal'!E9","v":"email3"}]
["Mechanical Consultant",{"$f":"'2- Proposal'!B10","v":"Company Name4"},{"$f":"'2- Proposal'!C10","v":"contact name4"},{"$f":"'2- Proposal'!D10","v":"phone4"},{"$f":"'2- Proposal'!E10","v":"email4"}]
{"$rows_left_out":130}
{"sheet":"4- Study Results","index":8,"n_rows":109,"n_cols":16,"rows_kept":109,"cut":false,"hidden":false,"merged":[[41,1,41,4],[41,9,41,13],[15,1,15,4],[15,9,15,12],[9,1,9,4],[9,9,9,12],[15,6,15,8]]}
["Provincial Commercial New Construction Program - Energy Study Results"]
["Green cells for user inputs (if applicable)",null,"DATE of SUBMISSION >>>",{"$f":"'3- Study Inputs'!D3","v":0},"Day-Month-Year"]
["Different building types must have separate sub-meters for electricity and gas where applicable. Energy consumption from individual sub-meters is to be used to fill tese two tables."]
[]
[null,"Building Type 1","Building Type 2","Building Type 3","Building Type 4","TOTAL"]
[{"$f":"'1- pre screen'!A21","v":"Building Type"},{"$f":"'3- Study Inputs'!B23:C23","v":0},{"$f":"'3- Study Inputs'!G23","v":0},{"$f":"'3- Study Inputs'!L23","v":0},{"$f":"'3- Study Inputs'!Q23","v":0}]
[{"$f":"'1- pre screen'!A22","v":"Conditioned Area (m2)"},{"$f":"'3- Study Inputs'!B24:C24","v":0},{"$f":"'3- Study Inputs'!G24","v":0},{"$f":"'3- Study Inputs'!L24","v":0},{"$f":"'3- Study Inputs'!Q24","v":0},{"$f":"SUM(B7:E7)","v":0},"m2"]
[]
[]
[null,"LCE Baseline Heat Loss Rate\n(Concept Design Model)",null,null,null,null,null,null,null,"Proposed Heat Loss Rate (W/m2)\n(Updated Design Model)"]
{"$rows_left_out":100}
{"sheet":"5- Incremental Costs","index":9,"n_rows":57,"n_cols":28,"rows_kept":57,"cut":false,"hidden":false,"merged":[[56,1,56,3],[56,6,56,7],[56,13,56,14],[36,3,36,8],[36,10,36,15],[38,1,40,1],[42,1,42,3],[44,1,45,1],[50,1,50,3],[46,1,48,1],[12,10,12,15],[4,3,4,7],[6,3,6,5],[8,3,8,5],[8,8,8,10],[12,1,13,1],[12,3,12,8],[18,1,18,3],[20,1,21,1],[20,3,20,8],[14,1,16,1],[20,10,20,15],[44,3,44,8],[44,10,44,15],[26,1,26,3],[22,1,24,1],[28,1,29,1],[28,3,28,8],[28,10,28,15],[30,1,32,1],[34,1,34,3],[36,1,37,1]]}
[null,null,null,null,null,null,null,null,null,null,null,null,null,null,null,null,null,null,null,null,null,null,null,"Hidden Y-AC"]
[null,"Provincial Commercial New Construction Program"]
[null,"Electrification Measure Incremental Capital Cost Estimate "]
[null,"Green cells for user inputs"]
[null,"Project:",null,{"$f":"'2- Proposal'!B5","v":"Project Name"}]
[]
[null,"Owner:",null,{"$f":"'2- Proposal'!B7","v":"Company Name1"}]
[]
[null,"Analysis by:",null,null,null,null,null,"Date:",{"$f":"'4- Study Results'!D2","v":0},null,null,"Day-Month-Year"]
[null,"This sheet accepts insertion of new rows - please complete \"Capital Cost $\" column formula if inserting row"]
{"$rows_left_out":48}
{"sheet":"6- Baseline Hourly Results","index":10,"n_rows":2,"n_cols":1,"rows_kept":2,"cut":false,"hidden":false,"merged":[]}
["Copy/paste hourly results from your model for the whole year for electricity AND gas"]
["the table should show breakdown of end uses (e.g. lighting, heating, cooling, etc.)"]

{"sheet":"7- Proposed Hourly Results","index":11,"n_rows":2,"n_cols":1,"rows_kept":2,"cut":false,"hidden":false,"merged":[]}
["Copy/paste hourly results from your model for the whole year for electricity AND gas"]
["the table should show breakdown of end uses (e.g. lighting, heating, cooling, etc.)"]

{"sheet":"Prescreening Review","index":12,"n_rows":2,"n_cols":7,"rows_kept":2,"cut":false,"hidden":false,"merged":[[0,0,0,2]]}
["Date",null,null,"DD-MMM-YYYY","DD-MMM-YYYY","DD-MMM-YYYY","DD-MMM-YYYY"]
["Comment #","Tab Name","Cell Reference","First Mechanical Review (reviewer name)","Response to First Mechanical Review (responder name)","Second Mechanical Review (reviewer name)","Response to Second Mechanical Review (responder name)"]

{"sheet":"Proposal Review","index":13,"n_rows":2,"n_cols":7,"rows_kept":2,"cut":false,"hidden":false,"merged":[[0,0,0,2]]}
["Date",null,null,"DD-MMM-YYYY","DD-MMM-YYYY","DD-MMM-YYYY","DD-MMM-YYYY"]
["Comment #","Tab Name","Cell Reference","First Mechanical Review (reviewer name)","Response to First Mechanical Review (responder name)","Second Mechanical Review (reviewer name)","Response to Second Mechanical Review (responder name)"]

{"sheet":"Study Review","index":14,"n_rows":2,"n_cols":7,"rows_kept":2,"cut":false,"hidden":false,"merged":[[0,0,0,2]]}
["Date",null,null,"DD-MMM-YYYY","DD-MMM-YYYY","DD-MMM-YYYY","DD-MMM-YYYY"]
["Comment #","Tab Name","Cell Reference","First Mechanical Review (reviewer name)","Response to First Mechanical Review (responder name)","Second Mechanical Review (reviewer name)","Response to Second Mechanical Review (responder name)"]

{"sheet":"Financial Model inputs","index":15,"n_rows":17,"n_cols":11,"rows_kept":17,"cut":false,"hidden":true,"merged":[]}
[]
[]
[]
[null,null,null,null,"Financial Model Inputs","Building 1","Building 2","Building 3","Building 4","TOTAL",{"$f":"E4","v":"Financial Model Inputs"}]
[null,null,null,null,"Elec Rate",{"$f":"'1- pre screen'!B37","v":0},{"$f":"'1- pre screen'!C37","v":0},{"$f":"'1- pre screen'!D37","v":0},{"$f":"'1- pre screen'!E37","v":0},{"$f":"('4- Study Results'!N97-J6*'4- Study Results'!N79)/'4- Study Results'!N72","v":{"$error":"#DIV/0!"}},"Elec Rate"]
[null,null,null,null,"Gas Rate",{"$f":"'1- pre screen'!B38","v":0},{"$f":"'1- pre screen'!C38","v":0},{"$f":"'1- pre screen'!D38","v":0},{"$f":"'1- pre screen'!E38","v":0},{"$f":"SUMPRODUCT('4- Study Results'!$B$7:$E$7,F6:I6)/'4- Study Results'!$F$7","v":{"$error":"#DIV/0!"}},"Gas Rate"]
[null,null,null,null,"Gas reduction GJ",{"$f":"'4- Study Results'!B44","v":0},{"$f":"'4- Study Results'!C44","v":0},{"$f":"'4- Study Results'!D44","v":0},{"$f":"'4- Study Results'!E44","v":0},{"$f":"SUM(F7:I7)","v":0},"Gas reduction GJ"]
[null,null,null,null,"Gas GHG reduction (tonns)",{"$f":"'4- Study Results'!B45","v":""},{"$f":"'4- Study Results'!C45","v":""},{"$f":"'4- Study Results'!D45","v":""},{"$f":"'4- Study Results'!E45","v":""},{"$f":"SUM(F8:I8)","v":0},"Gas GHG reduction (tonns)"]
[null,null,null,null,"Elect Growth kWh",{"$f":"'4- Study Results'!B43","v":0},{"$f":"'4- Study Results'!C43","v":0},{"$f":"'4- Study Results'!D43","v":0},{"$f":"'4- Study Results'!E43","v":0},{"$f":"SUM(F9:I9)","v":0},"Elect Growth kWh"]
[null,null,null,null,"Elec demand growth kW",{"$f":"'4- Study Results'!B43","v":0},{"$f":"'4- Study Results'!C43","v":0},{"$f":"'4- Study Results'!D43","v":0},{"$f":"'4- Study Results'!E43","v":0},{"$f":"SUM(G10:I10)","v":0},"Elec demand growth kW"]
{"$rows_left_out":7}